mediawiki/services/wikifeeds (main)

sourcepatches
$ date
Wed Dec 22 08:19:13 UTC 2021

$ git clone file:///srv/git/mediawiki-services-wikifeeds.git repo --depth=1 -b master
Cloning into 'repo'...

$ git config user.name libraryupgrader

$ git config user.email tools.libraryupgrader@tools.wmflabs.org

$ git submodule update --init

$ grr init
Installed commit-msg hook.

$ git show-ref refs/heads/master
c854584d515f31f11a625a493770e1f56dd03cac refs/heads/master

Attempting to npm audit fix
$ npm audit fix --only=dev

> pre-commit@1.2.2 install /src/repo/node_modules/pre-commit
> node install.js


> core-js@3.11.0 postinstall /src/repo/node_modules/core-js
> node -e "try{require('./postinstall')}catch(e){}"

Thank you for using core-js ( https://github.com/zloirock/core-js ) for polyfilling JavaScript standard library!

The project needs your help! Please consider supporting of core-js on Open Collective or Patreon: 
> https://opencollective.com/core-js 
> https://www.patreon.com/zloirock 

Also, the author of core-js ( https://github.com/zloirock ) is looking for a good job -)


> spawn-sync@1.0.15 postinstall /src/repo/node_modules/spawn-sync
> node postinstall

added 296 packages from 677 contributors in 25.162s

31 packages are looking for funding
  run `npm fund` for details

fixed 9 of 30 vulnerabilities in 560 scanned packages
  1 package update for 3 vulnerabilities involved breaking changes
  (use `npm audit fix --force` to install breaking changes; or refer to `npm audit` for steps to fix these manually)

$ npm audit fix --only=dev
up to date in 2.33s

31 packages are looking for funding
  run `npm fund` for details

fixed 0 of 18 vulnerabilities in 560 scanned packages
  1 package update for 3 vulnerabilities involved breaking changes
  (use `npm audit fix --force` to install breaking changes; or refer to `npm audit` for steps to fix these manually)

$ npm audit fix --only=dev
up to date in 2.366s

31 packages are looking for funding
  run `npm fund` for details

fixed 0 of 18 vulnerabilities in 560 scanned packages
  1 package update for 3 vulnerabilities involved breaking changes
  (use `npm audit fix --force` to install breaking changes; or refer to `npm audit` for steps to fix these manually)

$ package-lock-lint package-lock.json
Checking package-lock.json

Verifying that tests still pass
$ npm ci
npm WARN prepare removing existing node_modules/ before installation

> dtrace-provider@0.8.8 install /src/repo/node_modules/dtrace-provider
> node-gyp rebuild || node suppress-error.js

make: Entering directory '/src/repo/node_modules/dtrace-provider/build'
  TOUCH Release/obj.target/DTraceProviderStub.stamp
make: Leaving directory '/src/repo/node_modules/dtrace-provider/build'

> unix-dgram@2.0.4 install /src/repo/node_modules/unix-dgram
> node-gyp rebuild

make: Entering directory '/src/repo/node_modules/unix-dgram/build'
  CXX(target) Release/obj.target/unix_dgram/src/unix_dgram.o
In file included from ../src/unix_dgram.cc:5:
../../nan/nan.h: In function ‘void Nan::AsyncQueueWorker(Nan::AsyncWorker*)’:
../../nan/nan.h:2294:62: warning: cast between incompatible function types from ‘void (*)(uv_work_t*)’ {aka ‘void (*)(uv_work_s*)’} to ‘uv_after_work_cb’ {aka ‘void (*)(uv_work_s*, int)’} [-Wcast-function-type]
     , reinterpret_cast<uv_after_work_cb>(AsyncExecuteComplete)
                                                              ^
In file included from ../../nan/nan.h:56,
                 from ../src/unix_dgram.cc:5:
../src/unix_dgram.cc: At global scope:
/cache/node-gyp/10.24.0/include/node/node.h:573:43: warning: cast between incompatible function types from ‘void (*)(v8::Local<v8::Object>)’ to ‘node::addon_register_func’ {aka ‘void (*)(v8::Local<v8::Object>, v8::Local<v8::Value>, void*)’} [-Wcast-function-type]
       (node::addon_register_func) (regfunc),                          \
                                           ^
/cache/node-gyp/10.24.0/include/node/node.h:607:3: note: in expansion of macro ‘NODE_MODULE_X’
   NODE_MODULE_X(modname, regfunc, NULL, 0)  // NOLINT (readability/null_usage)
   ^~~~~~~~~~~~~
../src/unix_dgram.cc:404:1: note: in expansion of macro ‘NODE_MODULE’
 NODE_MODULE(unix_dgram, Initialize)
 ^~~~~~~~~~~
In file included from /cache/node-gyp/10.24.0/include/node/node.h:63,
                 from ../../nan/nan.h:56,
                 from ../src/unix_dgram.cc:5:
/cache/node-gyp/10.24.0/include/node/v8.h: In instantiation of ‘void v8::PersistentBase<T>::SetWeak(P*, typename v8::WeakCallbackInfo<P>::Callback, v8::WeakCallbackType) [with P = node::ObjectWrap; T = v8::Object; typename v8::WeakCallbackInfo<P>::Callback = void (*)(const v8::WeakCallbackInfo<node::ObjectWrap>&)]’:
/cache/node-gyp/10.24.0/include/node/node_object_wrap.h:84:78:   required from here
/cache/node-gyp/10.24.0/include/node/v8.h:9502:16: warning: cast between incompatible function types from ‘v8::WeakCallbackInfo<node::ObjectWrap>::Callback’ {aka ‘void (*)(const v8::WeakCallbackInfo<node::ObjectWrap>&)’} to ‘Callback’ {aka ‘void (*)(const v8::WeakCallbackInfo<void>&)’} [-Wcast-function-type]
                reinterpret_cast<Callback>(callback), type);
                ^~~~~~~~~~~~~~~~~~~~~~~~~~~~~~~~~~~~
/cache/node-gyp/10.24.0/include/node/v8.h: In instantiation of ‘void v8::PersistentBase<T>::SetWeak(P*, typename v8::WeakCallbackInfo<P>::Callback, v8::WeakCallbackType) [with P = Nan::ObjectWrap; T = v8::Object; typename v8::WeakCallbackInfo<P>::Callback = void (*)(const v8::WeakCallbackInfo<Nan::ObjectWrap>&)]’:
../../nan/nan_object_wrap.h:65:61:   required from here
/cache/node-gyp/10.24.0/include/node/v8.h:9502:16: warning: cast between incompatible function types from ‘v8::WeakCallbackInfo<Nan::ObjectWrap>::Callback’ {aka ‘void (*)(const v8::WeakCallbackInfo<Nan::ObjectWrap>&)’} to ‘Callback’ {aka ‘void (*)(const v8::WeakCallbackInfo<void>&)’} [-Wcast-function-type]
  SOLINK_MODULE(target) Release/obj.target/unix_dgram.node
  COPY Release/unix_dgram.node
make: Leaving directory '/src/repo/node_modules/unix-dgram/build'

> heapdump@0.3.15 install /src/repo/node_modules/heapdump
> node-gyp rebuild

make: Entering directory '/src/repo/node_modules/heapdump/build'
  CXX(target) Release/obj.target/addon/src/heapdump.o
In file included from ../src/heapdump.cc:17:
../../nan/nan.h: In function ‘void Nan::AsyncQueueWorker(Nan::AsyncWorker*)’:
../../nan/nan.h:2294:62: warning: cast between incompatible function types from ‘void (*)(uv_work_t*)’ {aka ‘void (*)(uv_work_s*)’} to ‘uv_after_work_cb’ {aka ‘void (*)(uv_work_s*, int)’} [-Wcast-function-type]
     , reinterpret_cast<uv_after_work_cb>(AsyncExecuteComplete)
                                                              ^
In file included from ../src/heapdump.cc:15:
../src/heapdump.cc: At global scope:
/cache/node-gyp/10.24.0/include/node/node.h:573:43: warning: cast between incompatible function types from ‘void (*)(Nan::ADDON_REGISTER_FUNCTION_ARGS_TYPE)’ {aka ‘void (*)(v8::Local<v8::Object>)’} to ‘node::addon_register_func’ {aka ‘void (*)(v8::Local<v8::Object>, v8::Local<v8::Value>, void*)’} [-Wcast-function-type]
       (node::addon_register_func) (regfunc),                          \
                                           ^
/cache/node-gyp/10.24.0/include/node/node.h:607:3: note: in expansion of macro ‘NODE_MODULE_X’
   NODE_MODULE_X(modname, regfunc, NULL, 0)  // NOLINT (readability/null_usage)
   ^~~~~~~~~~~~~
../src/heapdump.cc:136:1: note: in expansion of macro ‘NODE_MODULE’
 NODE_MODULE(addon, Initialize)
 ^~~~~~~~~~~
In file included from /cache/node-gyp/10.24.0/include/node/node.h:63,
                 from ../src/heapdump.cc:15:
/cache/node-gyp/10.24.0/include/node/v8.h: In instantiation of ‘void v8::PersistentBase<T>::SetWeak(P*, typename v8::WeakCallbackInfo<P>::Callback, v8::WeakCallbackType) [with P = node::ObjectWrap; T = v8::Object; typename v8::WeakCallbackInfo<P>::Callback = void (*)(const v8::WeakCallbackInfo<node::ObjectWrap>&)]’:
/cache/node-gyp/10.24.0/include/node/node_object_wrap.h:84:78:   required from here
/cache/node-gyp/10.24.0/include/node/v8.h:9502:16: warning: cast between incompatible function types from ‘v8::WeakCallbackInfo<node::ObjectWrap>::Callback’ {aka ‘void (*)(const v8::WeakCallbackInfo<node::ObjectWrap>&)’} to ‘Callback’ {aka ‘void (*)(const v8::WeakCallbackInfo<void>&)’} [-Wcast-function-type]
                reinterpret_cast<Callback>(callback), type);
                ^~~~~~~~~~~~~~~~~~~~~~~~~~~~~~~~~~~~
/cache/node-gyp/10.24.0/include/node/v8.h: In instantiation of ‘void v8::PersistentBase<T>::SetWeak(P*, typename v8::WeakCallbackInfo<P>::Callback, v8::WeakCallbackType) [with P = Nan::ObjectWrap; T = v8::Object; typename v8::WeakCallbackInfo<P>::Callback = void (*)(const v8::WeakCallbackInfo<Nan::ObjectWrap>&)]’:
../../nan/nan_object_wrap.h:65:61:   required from here
/cache/node-gyp/10.24.0/include/node/v8.h:9502:16: warning: cast between incompatible function types from ‘v8::WeakCallbackInfo<Nan::ObjectWrap>::Callback’ {aka ‘void (*)(const v8::WeakCallbackInfo<Nan::ObjectWrap>&)’} to ‘Callback’ {aka ‘void (*)(const v8::WeakCallbackInfo<void>&)’} [-Wcast-function-type]
  SOLINK_MODULE(target) Release/obj.target/addon.node
  COPY Release/addon.node
make: Leaving directory '/src/repo/node_modules/heapdump/build'

> gc-stats@1.4.0 install /src/repo/node_modules/gc-stats
> node-pre-gyp install --fallback-to-build

node-pre-gyp WARN Using request for node-pre-gyp https download 
[gc-stats] Success: "/src/repo/node_modules/gc-stats/build/gcstats/v1.4.0/Release/node-v64-linux-x64/gcstats.node" is installed via remote

> spawn-sync@1.0.15 postinstall /src/repo/node_modules/spawn-sync
> node postinstall


> pre-commit@1.2.2 install /src/repo/node_modules/pre-commit
> node install.js

pre-commit:
pre-commit: Detected an existing git pre-commit hook
pre-commit: Old pre-commit hook backuped to pre-commit.old
pre-commit:

> core-js@3.11.0 postinstall /src/repo/node_modules/core-js
> node -e "try{require('./postinstall')}catch(e){}"

added 492 packages in 18.752s

$ npm test

> @wikimedia/wikifeeds@1.0.0 test /src/repo
> npm run lint && PREQ_CONNECT_TIMEOUT=15 mocha


> @wikimedia/wikifeeds@1.0.0 lint /src/repo
> eslint --ext .js --ext .json .


Oops! Something went wrong! :(

ESLint: 7.25.0

ESLint couldn't find the plugin "eslint-plugin-jsdoc".

(The package "eslint-plugin-jsdoc" was not found when loaded as a Node module from the directory "/src/repo".)

It's likely that the plugin isn't installed correctly. Try reinstalling by running the following:

    npm install eslint-plugin-jsdoc@latest --save-dev

The plugin "eslint-plugin-jsdoc" was referenced from the config file in ".eslintrc.json » eslint-config-wikimedia/server » ./common » ./jsdoc".

If you still can't figure out the problem, please stop by https://eslint.org/chat/help to chat with the team.

npm ERR! code ELIFECYCLE
npm ERR! errno 2
npm ERR! @wikimedia/wikifeeds@1.0.0 lint: `eslint --ext .js --ext .json .`
npm ERR! Exit status 2
npm ERR! 
npm ERR! Failed at the @wikimedia/wikifeeds@1.0.0 lint script.
npm ERR! This is probably not a problem with npm. There is likely additional logging output above.

npm ERR! A complete log of this run can be found in:
npm ERR!     /cache/_logs/2021-12-22T08_20_15_572Z-debug.log
npm ERR! Test failed.  See above for more details.

Traceback (most recent call last):
  File "/venv/lib/python3.7/site-packages/runner-0.1.0-py3.7.egg/runner/__init__.py", line 1374, in main
    libup.run(args.repo, args.output, args.branch)
  File "/venv/lib/python3.7/site-packages/runner-0.1.0-py3.7.egg/runner/__init__.py", line 1318, in run
    self.npm_audit_fix(new_npm_audit)
  File "/venv/lib/python3.7/site-packages/runner-0.1.0-py3.7.egg/runner/__init__.py", line 216, in npm_audit_fix
    self.check_call(['npm', 'test'])
  File "/venv/lib/python3.7/site-packages/runner-0.1.0-py3.7.egg/runner/shell2.py", line 40, in check_call
    res.check_returncode()
  File "/usr/lib/python3.7/subprocess.py", line 428, in check_returncode
    self.stderr)
subprocess.CalledProcessError: Command '['npm', 'test']' returned non-zero exit status 1.

npm dependencies

Dependencies
Development dependencies

Logs

Source code is licensed under the AGPL.