mediawiki/extensions/Wikibase: REL1_35 (log #287824)

sourcepatches

This run took 2494 seconds.

$ date
Sun May 23 20:07:58 UTC 2021

$ git clone file:///srv/git/mediawiki-extensions-Wikibase.git repo --depth=1 -b REL1_35
Cloning into 'repo'...

$ git config user.name libraryupgrader

$ git config user.email tools.libraryupgrader@tools.wmflabs.org

$ git submodule update --init
Submodule 'lib/resources/wikibase-api' (https://gerrit.wikimedia.org/r/wikibase/javascript-api) registered for path 'lib/resources/wikibase-api'
Submodule 'view/lib/wikibase-data-model' (https://phabricator.wikimedia.org/source/wikibase-data-model.git) registered for path 'view/lib/wikibase-data-model'
Submodule 'view/lib/wikibase-data-values' (https://phabricator.wikimedia.org/source/datavalues-javascript.git) registered for path 'view/lib/wikibase-data-values'
Submodule 'view/lib/wikibase-data-values-value-view' (https://gerrit.wikimedia.org/r/data-values/value-view) registered for path 'view/lib/wikibase-data-values-value-view'
Submodule 'view/lib/wikibase-serialization' (https://phabricator.wikimedia.org/source/wikibase-serialization.git) registered for path 'view/lib/wikibase-serialization'
Submodule 'view/lib/wikibase-termbox' (https://phabricator.wikimedia.org/source/wikibase-termbox) registered for path 'view/lib/wikibase-termbox'
Cloning into '/src/repo/lib/resources/wikibase-api'...
Cloning into '/src/repo/view/lib/wikibase-data-model'...
Cloning into '/src/repo/view/lib/wikibase-data-values-value-view'...
Cloning into '/src/repo/view/lib/wikibase-data-values'...
Cloning into '/src/repo/view/lib/wikibase-termbox'...
Cloning into '/src/repo/view/lib/wikibase-serialization'...
Submodule path 'lib/resources/wikibase-api': checked out '2bdd34cbe4c31cf67f0bf72d968c289209ff6cc8'
Submodule path 'view/lib/wikibase-data-model': checked out 'b284d2e8d204d86515ebadd9b3fbe1b26e786099'
Submodule path 'view/lib/wikibase-data-values': checked out '59086c58bdb1b95a1c653b9cc4b7c1ebf69f117c'
Submodule path 'view/lib/wikibase-data-values-value-view': checked out '8b0d103580dbeab8b7e0a873d94080a673808f26'
Submodule path 'view/lib/wikibase-serialization': checked out '6b97c0fea57a217f95cea3f18cee80d9ce30f69d'
Submodule path 'view/lib/wikibase-termbox': checked out '14da5b45e661f943b17c34b148ec071c93902324'

$ grr init
Installed commit-msg hook.

$ git show-ref refs/heads/REL1_35
0b76403d85236a58eadf1b68e7d3eb6f48051b68 refs/heads/REL1_35

$ composer install
Loading composer repositories with package information
Warning from https://repo.packagist.org: You are using an outdated version of Composer. Composer 2 is now available and you should upgrade. See https://getcomposer.org/2
Updating dependencies (including require-dev)
Package operations: 58 installs, 0 updates, 0 removals
  - Installing composer/installers (v1.11.0): Loading from cache
  - Installing wikimedia/purtle (v1.0.7): Loading from cache
  - Installing psr/simple-cache (1.0.1): Loading from cache
  - Installing symfony/polyfill-mbstring (v1.22.1): Loading from cache
  - Installing symfony/polyfill-php80 (v1.22.1): Loading from cache
  - Installing symfony/polyfill-intl-normalizer (v1.22.1): Loading from cache
  - Installing symfony/polyfill-intl-grapheme (v1.22.1): Loading from cache
  - Installing symfony/polyfill-ctype (v1.22.1): Loading from cache
  - Installing symfony/string (v5.2.8): Loading from cache
  - Installing psr/container (1.1.1): Loading from cache
  - Installing symfony/service-contracts (v2.4.0): Loading from cache
  - Installing symfony/polyfill-php73 (v1.22.1): Loading from cache
  - Installing symfony/console (v5.2.8): Loading from cache
  - Installing psr/log (1.1.4): Loading from cache
  - Installing sabre/event (5.1.2): Loading from cache
  - Installing netresearch/jsonmapper (v2.1.0): Loading from cache
  - Installing microsoft/tolerant-php-parser (v0.0.20): Loading from cache
  - Installing phpdocumentor/reflection-common (2.2.0): Loading from cache
  - Installing webmozart/assert (1.10.0): Loading from cache
  - Installing phpdocumentor/type-resolver (1.4.0): Loading from cache
  - Installing phpdocumentor/reflection-docblock (5.2.2): Loading from cache
  - Installing felixfbecker/advanced-json-rpc (v3.2.0): Loading from cache
  - Installing composer/xdebug-handler (1.4.6): Loading from cache
  - Installing composer/semver (1.5.0): Loading from cache
  - Installing phan/phan (2.6.1): Loading from cache
  - Installing mediawiki/phan-taint-check-plugin (3.0.2): Loading from cache
  - Installing mediawiki/mediawiki-phan-config (0.10.2): Loading from cache
  - Installing mediawiki/minus-x (1.1.0): Loading from cache
  - Installing php-parallel-lint/php-console-color (v0.3): Loading from cache
  - Installing php-parallel-lint/php-console-highlighter (v0.5): Loading from cache
  - Installing php-parallel-lint/php-parallel-lint (v1.2.0): Loading from cache
  - Installing squizlabs/php_codesniffer (3.5.3): Loading from cache
  - Installing composer/spdx-licenses (1.5.2): Loading from cache
  - Installing mediawiki/mediawiki-codesniffer (v29.0.0): Loading from cache
  - Installing wikibase/wikibase-codesniffer (1.1.0): Downloading (connecting...)Downloading (100%)         
  - Installing data-values/interfaces (0.2.5): Loading from cache
  - Installing data-values/data-values (2.3.0): Loading from cache
  - Installing data-values/geo (4.3.0): Downloading (connecting...)Downloading (100%)         
  - Installing data-values/common (0.4.3): Loading from cache
  - Installing data-values/number (0.10.2): Loading from cache
  - Installing data-values/time (1.0.3): Downloading (connecting...)Downloading (100%)         
  - Installing serialization/serialization (4.0.0): Loading from cache
  - Installing data-values/serialization (1.2.4): Loading from cache
  - Installing monolog/monolog (2.2.0): Loading from cache
  - Installing wikimedia/assert (v0.5.0): Loading from cache
  - Installing wikibase/data-model (9.6.1): Loading from cache
  - Installing wikibase/data-model-serialization (2.9.1): Loading from cache
  - Installing wikibase/internal-serialization (2.10.0): Downloading (connecting...)Downloading (100%)         
  - Installing diff/diff (3.2.0): Loading from cache
  - Installing wikibase/data-model-services (5.4.0): Loading from cache
  - Installing onoi/message-reporter (1.4.2): Loading from cache
  - Installing ralouphie/getallheaders (3.0.3): Loading from cache
  - Installing psr/http-message (1.0.1): Loading from cache
  - Installing guzzlehttp/psr7 (1.8.2): Loading from cache
  - Installing guzzlehttp/promises (1.4.1): Loading from cache
  - Installing symfony/polyfill-php72 (v1.22.1): Loading from cache
  - Installing symfony/polyfill-intl-idn (v1.22.1): Loading from cache
  - Installing guzzlehttp/guzzle (6.5.5): Loading from cache
symfony/service-contracts suggests installing symfony/service-implementation
symfony/console suggests installing symfony/event-dispatcher
symfony/console suggests installing symfony/lock
symfony/console suggests installing symfony/process
phan/phan suggests installing ext-ast (Needed for parsing ASTs (unless --use-fallback-parser is used). 1.0.1+ is needed, 1.0.6+ is recommended.)
monolog/monolog suggests installing graylog2/gelf-php (Allow sending log messages to a GrayLog2 server)
monolog/monolog suggests installing doctrine/couchdb (Allow sending log messages to a CouchDB server)
monolog/monolog suggests installing ruflin/elastica (Allow sending log messages to an Elastic Search server)
monolog/monolog suggests installing elasticsearch/elasticsearch (Allow sending log messages to an Elasticsearch server via official client)
monolog/monolog suggests installing php-amqplib/php-amqplib (Allow sending log messages to an AMQP server using php-amqplib)
monolog/monolog suggests installing ext-amqp (Allow sending log messages to an AMQP server (1.0+ required))
monolog/monolog suggests installing ext-mongodb (Allow sending log messages to a MongoDB server (via driver))
monolog/monolog suggests installing mongodb/mongodb (Allow sending log messages to a MongoDB server (via library))
monolog/monolog suggests installing aws/aws-sdk-php (Allow sending log messages to AWS services like DynamoDB)
monolog/monolog suggests installing rollbar/rollbar (Allow sending log messages to Rollbar)
monolog/monolog suggests installing php-console/php-console (Allow sending log messages to Google Chrome)
guzzlehttp/psr7 suggests installing laminas/laminas-httphandlerrunner (Emit PSR-7 responses)
Package wikibase/wikibase-codesniffer is abandoned, you should avoid using it. Use mediawiki/mediawiki-codesniffer instead.
Writing lock file
Generating autoload files
16 packages you are using are looking for funding.
Use the `composer fund` command to find out more!

$ npm install
npm WARN deprecated request@2.88.2: request has been deprecated, see https://github.com/request/request/issues/3142
npm WARN deprecated har-validator@5.1.5: this library is no longer supported

> fibers_node_v8@3.1.5 preinstall /src/repo/node_modules/fibers_node_v8
> node preinstall.js


> fibers@4.0.3 install /src/repo/node_modules/fibers
> node build.js || nodejs build.js

`linux-x64-64-glibc` exists; testing
Binary is fine; exiting

> fibers_node_v8@3.1.5 install /src/repo/node_modules/fibers_node_v8
> node build.js

ignore install

> Wikibase@0.1.0 postinstall /src/repo
> npm-run-all -p install:*


> Wikibase@0.1.0 install:tainted-ref /src/repo
> npm --prefix view/lib/wikibase-tainted-ref ci


> Wikibase@0.1.0 install:bridge /src/repo
> npm --prefix client/data-bridge ci


> core-js@3.6.4 postinstall /src/repo/client/data-bridge/node_modules/core-js
> node -e "try{require('./postinstall')}catch(e){}"

Thank you for using core-js ( https://github.com/zloirock/core-js ) for polyfilling JavaScript standard library!

The project needs your help! Please consider supporting of core-js on Open Collective or Patreon: 
> https://opencollective.com/core-js 
> https://www.patreon.com/zloirock 

Also, the author of core-js ( https://github.com/zloirock ) is looking for a good job -)


> node-sass@4.13.1 install /src/repo/client/data-bridge/node_modules/node-sass
> node scripts/install.js

Cached binary found at /cache/_cacache/node-sass/4.13.1/linux-x64-64_binding.node

> node-sass@4.13.1 postinstall /src/repo/client/data-bridge/node_modules/node-sass
> node scripts/build.js

Binary found at /src/repo/client/data-bridge/node_modules/node-sass/vendor/linux-x64-64/binding.node
Testing binary
Binary is fine

> fibers_node_v8@3.1.5 preinstall /src/repo/client/data-bridge/node_modules/fibers_node_v8
> node preinstall.js


> fibers_node_v8@3.1.5 install /src/repo/client/data-bridge/node_modules/fibers_node_v8
> node build.js

ignore install

> fibers@4.0.3 install /src/repo/client/data-bridge/node_modules/fibers
> node build.js || nodejs build.js

`linux-x64-64-glibc` exists; testing
Binary is fine; exiting

> ejs@3.1.2 postinstall /src/repo/client/data-bridge/node_modules/@wdio/cli/node_modules/ejs
> node --harmony ./postinstall.js

Thank you for installing EJS: built with the Jake JavaScript build tool (https://jakejs.com/)


> fsevents@1.2.11 install /src/repo/client/data-bridge/node_modules/fsevents
> node-gyp rebuild


> core-js@2.6.9 postinstall /src/repo/view/lib/wikibase-tainted-ref/node_modules/core-js
> node scripts/postinstall || echo "ignore"

Thank you for using core-js ( https://github.com/zloirock/core-js ) for polyfilling JavaScript standard library!

The project needs your help! Please consider supporting of core-js on Open Collective or Patreon: 
> https://opencollective.com/core-js 
> https://www.patreon.com/zloirock 

Also, the author of core-js ( https://github.com/zloirock ) is looking for a good job -)


> node-sass@4.13.1 install /src/repo/view/lib/wikibase-tainted-ref/node_modules/node-sass
> node scripts/install.js

make: Entering directory '/src/repo/client/data-bridge/node_modules/fsevents/build'
  SOLINK_MODULE(target) Release/obj.target/.node
Cached binary found at /cache/_cacache/node-sass/4.13.1/linux-x64-64_binding.node

> node-sass@4.13.1 postinstall /src/repo/view/lib/wikibase-tainted-ref/node_modules/node-sass
> node scripts/build.js

  COPY Release/.node
make: Leaving directory '/src/repo/client/data-bridge/node_modules/fsevents/build'

> ejs@2.7.4 postinstall /src/repo/client/data-bridge/node_modules/ejs
> node ./postinstall.js

Binary found at /src/repo/view/lib/wikibase-tainted-ref/node_modules/node-sass/vendor/linux-x64-64/binding.node
Testing binary
Binary is fine

> fsevents@1.2.9 install /src/repo/view/lib/wikibase-tainted-ref/node_modules/fsevents
> node install

Thank you for installing EJS: built with the Jake JavaScript build tool (https://jakejs.com/)


> core-js@2.6.11 postinstall /src/repo/client/data-bridge/node_modules/babel-runtime/node_modules/core-js
> node -e "try{require('./postinstall')}catch(e){}"


> fibers_node_v8@3.1.5 preinstall /src/repo/view/lib/wikibase-tainted-ref/node_modules/fibers_node_v8
> node preinstall.js


> fibers_node_v8@3.1.5 install /src/repo/view/lib/wikibase-tainted-ref/node_modules/fibers_node_v8
> node build.js


> yorkie@2.0.0 install /src/repo/client/data-bridge/node_modules/yorkie
> node bin/install.js

ignore install
setting up Git hooks
can't find .git directory, skipping Git hooks installation

> fibers@4.0.1 install /src/repo/view/lib/wikibase-tainted-ref/node_modules/fibers
> node build.js || nodejs build.js


> core-js-pure@3.6.4 postinstall /src/repo/client/data-bridge/node_modules/core-js-pure
> node -e "try{require('./postinstall')}catch(e){}"

`linux-x64-64-glibc` exists; testing

> data-bridge@0.1.0 prepare /src/repo/client/data-bridge
> node build/wikimedia-ui-base.js

Binary is fine; exiting
added 2824 packages in 52.301s

> yorkie@2.0.0 install /src/repo/view/lib/wikibase-tainted-ref/node_modules/yorkie
> node bin/install.js

setting up Git hooks
can't find .git directory, skipping Git hooks installation

> core-js@3.6.4 postinstall /src/repo/view/lib/wikibase-tainted-ref/node_modules/@storybook/api/node_modules/core-js
> node -e "try{require('./postinstall')}catch(e){}"


> core-js@3.6.4 postinstall /src/repo/view/lib/wikibase-tainted-ref/node_modules/@storybook/theming/node_modules/core-js
> node -e "try{require('./postinstall')}catch(e){}"


> core-js@3.6.4 postinstall /src/repo/view/lib/wikibase-tainted-ref/node_modules/@storybook/client-logger/node_modules/core-js
> node -e "try{require('./postinstall')}catch(e){}"


> core-js@3.6.4 postinstall /src/repo/view/lib/wikibase-tainted-ref/node_modules/@storybook/router/node_modules/core-js
> node -e "try{require('./postinstall')}catch(e){}"


> core-js@3.6.4 postinstall /src/repo/view/lib/wikibase-tainted-ref/node_modules/@storybook/core-events/node_modules/core-js
> node -e "try{require('./postinstall')}catch(e){}"


> core-js@3.6.4 postinstall /src/repo/view/lib/wikibase-tainted-ref/node_modules/@storybook/channels/node_modules/core-js
> node -e "try{require('./postinstall')}catch(e){}"


> core-js@3.6.4 postinstall /src/repo/view/lib/wikibase-tainted-ref/node_modules/@storybook/addons/node_modules/core-js
> node -e "try{require('./postinstall')}catch(e){}"


> core-js@3.6.4 postinstall /src/repo/view/lib/wikibase-tainted-ref/node_modules/@storybook/vue/node_modules/core-js
> node -e "try{require('./postinstall')}catch(e){}"


> core-js@3.6.4 postinstall /src/repo/view/lib/wikibase-tainted-ref/node_modules/lazy-universal-dotenv/node_modules/core-js
> node -e "try{require('./postinstall')}catch(e){}"


> ejs@2.7.4 postinstall /src/repo/view/lib/wikibase-tainted-ref/node_modules/@storybook/core/node_modules/ejs
> node ./postinstall.js

Thank you for installing EJS: built with the Jake JavaScript build tool (https://jakejs.com/)


> core-js@3.6.4 postinstall /src/repo/view/lib/wikibase-tainted-ref/node_modules/@storybook/core/node_modules/core-js
> node -e "try{require('./postinstall')}catch(e){}"


> core-js@3.6.4 postinstall /src/repo/view/lib/wikibase-tainted-ref/node_modules/simplebar/node_modules/core-js
> node -e "try{require('./postinstall')}catch(e){}"


> core-js@3.6.4 postinstall /src/repo/view/lib/wikibase-tainted-ref/node_modules/@storybook/components/node_modules/core-js
> node -e "try{require('./postinstall')}catch(e){}"


> core-js-pure@3.6.4 postinstall /src/repo/view/lib/wikibase-tainted-ref/node_modules/core-js-pure
> node -e "try{require('./postinstall')}catch(e){}"


> core-js@3.6.4 postinstall /src/repo/view/lib/wikibase-tainted-ref/node_modules/@storybook/ui/node_modules/core-js
> node -e "try{require('./postinstall')}catch(e){}"


> core-js@3.6.4 postinstall /src/repo/view/lib/wikibase-tainted-ref/node_modules/@storybook/node-logger/node_modules/core-js
> node -e "try{require('./postinstall')}catch(e){}"


> core-js@3.6.4 postinstall /src/repo/view/lib/wikibase-tainted-ref/node_modules/@storybook/channel-postmessage/node_modules/core-js
> node -e "try{require('./postinstall')}catch(e){}"


> core-js@3.6.4 postinstall /src/repo/view/lib/wikibase-tainted-ref/node_modules/@storybook/client-api/node_modules/core-js
> node -e "try{require('./postinstall')}catch(e){}"


> core-js@3.6.4 postinstall /src/repo/view/lib/wikibase-tainted-ref/node_modules/@storybook/addon-links/node_modules/core-js
> node -e "try{require('./postinstall')}catch(e){}"


> core-js@3.6.4 postinstall /src/repo/view/lib/wikibase-tainted-ref/node_modules/@storybook/addon-actions/node_modules/core-js
> node -e "try{require('./postinstall')}catch(e){}"


> core-js@3.6.4 postinstall /src/repo/view/lib/wikibase-tainted-ref/node_modules/@storybook/addon-a11y/node_modules/core-js
> node -e "try{require('./postinstall')}catch(e){}"


> tainted-ref@0.1.0 prepare /src/repo/view/lib/wikibase-tainted-ref
> node build/wikimedia-ui-base.js

added 2971 packages in 67.006s
npm notice created a lockfile as package-lock.json. You should commit this file.
npm WARN optional SKIPPING OPTIONAL DEPENDENCY: fsevents@~2.3.1 (node_modules/chokidar/node_modules/fsevents):
npm WARN notsup SKIPPING OPTIONAL DEPENDENCY: Unsupported platform for fsevents@2.3.2: wanted {"os":"darwin","arch":"any"} (current: {"os":"linux","arch":"x64"})
npm WARN optional SKIPPING OPTIONAL DEPENDENCY: fsevents@~2.1.1 (node_modules/mocha/node_modules/chokidar/node_modules/fsevents):
npm WARN notsup SKIPPING OPTIONAL DEPENDENCY: Unsupported platform for fsevents@2.1.3: wanted {"os":"darwin","arch":"any"} (current: {"os":"linux","arch":"x64"})
npm WARN notsup Unsupported engine for fibers_node_v8@3.1.5: wanted: {"node":">=8.0.0 <10.0.0"} (current: {"node":"10.24.0","npm":"6.14.5"})
npm WARN notsup Not compatible with your version of node/npm: fibers_node_v8@3.1.5
npm WARN wdio-wikibase@3.0.1 requires a peer of wdio-mediawiki@^0.3.0 but none is installed. You must install peer dependencies yourself.
npm WARN wdio-wikibase@3.0.1 requires a peer of webdriverio@~5.0 but none is installed. You must install peer dependencies yourself.
npm WARN eslint-plugin-vue@6.2.2 requires a peer of eslint@^5.0.0 || ^6.0.0 but none is installed. You must install peer dependencies yourself.

added 1166 packages from 587 contributors and audited 1169 packages in 650.493s

105 packages are looking for funding
  run `npm fund` for details

found 9 vulnerabilities (8 moderate, 1 high)
  run `npm audit fix` to fix them, or `npm audit` for details

$ package-lock-lint package-lock.json
0 issues found in: package-lock.json

Upgrading n:grunt from 1.1.0 -> 1.4.0
$ npm install

> Wikibase@0.1.0 postinstall /src/repo
> npm-run-all -p install:*


> Wikibase@0.1.0 install:bridge /src/repo
> npm --prefix client/data-bridge ci


> Wikibase@0.1.0 install:tainted-ref /src/repo
> npm --prefix view/lib/wikibase-tainted-ref ci

npm WARN prepare removing existing node_modules/ before installation
npm WARN prepare removing existing node_modules/ before installation

> core-js@3.6.4 postinstall /src/repo/client/data-bridge/node_modules/core-js
> node -e "try{require('./postinstall')}catch(e){}"

Thank you for using core-js ( https://github.com/zloirock/core-js ) for polyfilling JavaScript standard library!

The project needs your help! Please consider supporting of core-js on Open Collective or Patreon: 
> https://opencollective.com/core-js 
> https://www.patreon.com/zloirock 

Also, the author of core-js ( https://github.com/zloirock ) is looking for a good job -)


> node-sass@4.13.1 install /src/repo/client/data-bridge/node_modules/node-sass
> node scripts/install.js

Cached binary found at /cache/_cacache/node-sass/4.13.1/linux-x64-64_binding.node

> node-sass@4.13.1 postinstall /src/repo/client/data-bridge/node_modules/node-sass
> node scripts/build.js

Binary found at /src/repo/client/data-bridge/node_modules/node-sass/vendor/linux-x64-64/binding.node
Testing binary
Binary is fine

> fibers_node_v8@3.1.5 preinstall /src/repo/client/data-bridge/node_modules/fibers_node_v8
> node preinstall.js


> fibers_node_v8@3.1.5 install /src/repo/client/data-bridge/node_modules/fibers_node_v8
> node build.js

ignore install

> fibers@4.0.3 install /src/repo/client/data-bridge/node_modules/fibers
> node build.js || nodejs build.js

`linux-x64-64-glibc` exists; testing
Binary is fine; exiting

> ejs@3.1.2 postinstall /src/repo/client/data-bridge/node_modules/@wdio/cli/node_modules/ejs
> node --harmony ./postinstall.js

Thank you for installing EJS: built with the Jake JavaScript build tool (https://jakejs.com/)


> fsevents@1.2.11 install /src/repo/client/data-bridge/node_modules/fsevents
> node-gyp rebuild


> core-js@2.6.9 postinstall /src/repo/view/lib/wikibase-tainted-ref/node_modules/core-js
> node scripts/postinstall || echo "ignore"

make: Entering directory '/src/repo/client/data-bridge/node_modules/fsevents/build'
  SOLINK_MODULE(target) Release/obj.target/.node
  COPY Release/.node
make: Leaving directory '/src/repo/client/data-bridge/node_modules/fsevents/build'
Thank you for using core-js ( https://github.com/zloirock/core-js ) for polyfilling JavaScript standard library!

The project needs your help! Please consider supporting of core-js on Open Collective or Patreon: 
> https://opencollective.com/core-js 
> https://www.patreon.com/zloirock 

Also, the author of core-js ( https://github.com/zloirock ) is looking for a good job -)


> ejs@2.7.4 postinstall /src/repo/client/data-bridge/node_modules/ejs
> node ./postinstall.js

Thank you for installing EJS: built with the Jake JavaScript build tool (https://jakejs.com/)


> node-sass@4.13.1 install /src/repo/view/lib/wikibase-tainted-ref/node_modules/node-sass
> node scripts/install.js


> core-js@2.6.11 postinstall /src/repo/client/data-bridge/node_modules/babel-runtime/node_modules/core-js
> node -e "try{require('./postinstall')}catch(e){}"

Cached binary found at /cache/_cacache/node-sass/4.13.1/linux-x64-64_binding.node

> node-sass@4.13.1 postinstall /src/repo/view/lib/wikibase-tainted-ref/node_modules/node-sass
> node scripts/build.js


> yorkie@2.0.0 install /src/repo/client/data-bridge/node_modules/yorkie
> node bin/install.js

Binary found at /src/repo/view/lib/wikibase-tainted-ref/node_modules/node-sass/vendor/linux-x64-64/binding.node
Testing binary
Binary is fine

> fsevents@1.2.9 install /src/repo/view/lib/wikibase-tainted-ref/node_modules/fsevents
> node install

setting up Git hooks
can't find .git directory, skipping Git hooks installation

> fibers_node_v8@3.1.5 preinstall /src/repo/view/lib/wikibase-tainted-ref/node_modules/fibers_node_v8
> node preinstall.js


> fibers_node_v8@3.1.5 install /src/repo/view/lib/wikibase-tainted-ref/node_modules/fibers_node_v8
> node build.js


> core-js-pure@3.6.4 postinstall /src/repo/client/data-bridge/node_modules/core-js-pure
> node -e "try{require('./postinstall')}catch(e){}"

ignore install

> fibers@4.0.1 install /src/repo/view/lib/wikibase-tainted-ref/node_modules/fibers
> node build.js || nodejs build.js


> data-bridge@0.1.0 prepare /src/repo/client/data-bridge
> node build/wikimedia-ui-base.js

`linux-x64-64-glibc` exists; testing
Binary is fine; exiting
added 2824 packages in 118.761s

> yorkie@2.0.0 install /src/repo/view/lib/wikibase-tainted-ref/node_modules/yorkie
> node bin/install.js

setting up Git hooks
can't find .git directory, skipping Git hooks installation

> core-js@3.6.4 postinstall /src/repo/view/lib/wikibase-tainted-ref/node_modules/@storybook/api/node_modules/core-js
> node -e "try{require('./postinstall')}catch(e){}"


> core-js@3.6.4 postinstall /src/repo/view/lib/wikibase-tainted-ref/node_modules/@storybook/theming/node_modules/core-js
> node -e "try{require('./postinstall')}catch(e){}"


> core-js@3.6.4 postinstall /src/repo/view/lib/wikibase-tainted-ref/node_modules/@storybook/client-logger/node_modules/core-js
> node -e "try{require('./postinstall')}catch(e){}"


> core-js@3.6.4 postinstall /src/repo/view/lib/wikibase-tainted-ref/node_modules/@storybook/router/node_modules/core-js
> node -e "try{require('./postinstall')}catch(e){}"


> core-js@3.6.4 postinstall /src/repo/view/lib/wikibase-tainted-ref/node_modules/@storybook/core-events/node_modules/core-js
> node -e "try{require('./postinstall')}catch(e){}"


> core-js@3.6.4 postinstall /src/repo/view/lib/wikibase-tainted-ref/node_modules/@storybook/channels/node_modules/core-js
> node -e "try{require('./postinstall')}catch(e){}"


> core-js@3.6.4 postinstall /src/repo/view/lib/wikibase-tainted-ref/node_modules/@storybook/addons/node_modules/core-js
> node -e "try{require('./postinstall')}catch(e){}"


> core-js@3.6.4 postinstall /src/repo/view/lib/wikibase-tainted-ref/node_modules/@storybook/vue/node_modules/core-js
> node -e "try{require('./postinstall')}catch(e){}"


> core-js@3.6.4 postinstall /src/repo/view/lib/wikibase-tainted-ref/node_modules/lazy-universal-dotenv/node_modules/core-js
> node -e "try{require('./postinstall')}catch(e){}"


> ejs@2.7.4 postinstall /src/repo/view/lib/wikibase-tainted-ref/node_modules/@storybook/core/node_modules/ejs
> node ./postinstall.js

Thank you for installing EJS: built with the Jake JavaScript build tool (https://jakejs.com/)


> core-js@3.6.4 postinstall /src/repo/view/lib/wikibase-tainted-ref/node_modules/@storybook/core/node_modules/core-js
> node -e "try{require('./postinstall')}catch(e){}"


> core-js@3.6.4 postinstall /src/repo/view/lib/wikibase-tainted-ref/node_modules/simplebar/node_modules/core-js
> node -e "try{require('./postinstall')}catch(e){}"


> core-js@3.6.4 postinstall /src/repo/view/lib/wikibase-tainted-ref/node_modules/@storybook/components/node_modules/core-js
> node -e "try{require('./postinstall')}catch(e){}"


> core-js-pure@3.6.4 postinstall /src/repo/view/lib/wikibase-tainted-ref/node_modules/core-js-pure
> node -e "try{require('./postinstall')}catch(e){}"


> core-js@3.6.4 postinstall /src/repo/view/lib/wikibase-tainted-ref/node_modules/@storybook/ui/node_modules/core-js
> node -e "try{require('./postinstall')}catch(e){}"


> core-js@3.6.4 postinstall /src/repo/view/lib/wikibase-tainted-ref/node_modules/@storybook/node-logger/node_modules/core-js
> node -e "try{require('./postinstall')}catch(e){}"


> core-js@3.6.4 postinstall /src/repo/view/lib/wikibase-tainted-ref/node_modules/@storybook/channel-postmessage/node_modules/core-js
> node -e "try{require('./postinstall')}catch(e){}"


> core-js@3.6.4 postinstall /src/repo/view/lib/wikibase-tainted-ref/node_modules/@storybook/client-api/node_modules/core-js
> node -e "try{require('./postinstall')}catch(e){}"


> core-js@3.6.4 postinstall /src/repo/view/lib/wikibase-tainted-ref/node_modules/@storybook/addon-links/node_modules/core-js
> node -e "try{require('./postinstall')}catch(e){}"


> core-js@3.6.4 postinstall /src/repo/view/lib/wikibase-tainted-ref/node_modules/@storybook/addon-actions/node_modules/core-js
> node -e "try{require('./postinstall')}catch(e){}"


> core-js@3.6.4 postinstall /src/repo/view/lib/wikibase-tainted-ref/node_modules/@storybook/addon-a11y/node_modules/core-js
> node -e "try{require('./postinstall')}catch(e){}"


> tainted-ref@0.1.0 prepare /src/repo/view/lib/wikibase-tainted-ref
> node build/wikimedia-ui-base.js

added 2971 packages in 236.129s
npm WARN eslint-plugin-vue@6.2.2 requires a peer of eslint@^5.0.0 || ^6.0.0 but none is installed. You must install peer dependencies yourself.
npm WARN wdio-wikibase@3.0.1 requires a peer of wdio-mediawiki@^0.3.0 but none is installed. You must install peer dependencies yourself.
npm WARN wdio-wikibase@3.0.1 requires a peer of webdriverio@~5.0 but none is installed. You must install peer dependencies yourself.
npm WARN optional SKIPPING OPTIONAL DEPENDENCY: fsevents@2.3.2 (node_modules/fsevents):
npm WARN notsup SKIPPING OPTIONAL DEPENDENCY: Unsupported platform for fsevents@2.3.2: wanted {"os":"darwin","arch":"any"} (current: {"os":"linux","arch":"x64"})
npm WARN optional SKIPPING OPTIONAL DEPENDENCY: fsevents@2.1.3 (node_modules/mocha/node_modules/fsevents):
npm WARN notsup SKIPPING OPTIONAL DEPENDENCY: Unsupported platform for fsevents@2.1.3: wanted {"os":"darwin","arch":"any"} (current: {"os":"linux","arch":"x64"})

added 38 packages from 42 contributors, removed 21 packages, updated 9 packages and audited 1186 packages in 366.005s

105 packages are looking for funding
  run `npm fund` for details

found 8 moderate severity vulnerabilities
  run `npm audit fix` to fix them, or `npm audit` for details

$ package-lock-lint package-lock.json
0 issues found in: package-lock.json

$ npm ci
npm WARN prepare removing existing node_modules/ before installation

> fibers@4.0.3 install /src/repo/node_modules/fibers
> node build.js || nodejs build.js

`linux-x64-64-glibc` exists; testing
Binary is fine; exiting

> fibers_node_v8@3.1.5 preinstall /src/repo/node_modules/fibers_node_v8
> node preinstall.js


> fibers_node_v8@3.1.5 install /src/repo/node_modules/fibers_node_v8
> node build.js

ignore install

> Wikibase@0.1.0 postinstall /src/repo
> npm-run-all -p install:*


> Wikibase@0.1.0 install:tainted-ref /src/repo
> npm --prefix view/lib/wikibase-tainted-ref ci


> Wikibase@0.1.0 install:bridge /src/repo
> npm --prefix client/data-bridge ci

npm WARN prepare removing existing node_modules/ before installation
npm WARN prepare removing existing node_modules/ before installation

> core-js@3.6.4 postinstall /src/repo/client/data-bridge/node_modules/core-js
> node -e "try{require('./postinstall')}catch(e){}"

Thank you for using core-js ( https://github.com/zloirock/core-js ) for polyfilling JavaScript standard library!

The project needs your help! Please consider supporting of core-js on Open Collective or Patreon: 
> https://opencollective.com/core-js 
> https://www.patreon.com/zloirock 

Also, the author of core-js ( https://github.com/zloirock ) is looking for a good job -)


> node-sass@4.13.1 install /src/repo/client/data-bridge/node_modules/node-sass
> node scripts/install.js

Cached binary found at /cache/_cacache/node-sass/4.13.1/linux-x64-64_binding.node

> node-sass@4.13.1 postinstall /src/repo/client/data-bridge/node_modules/node-sass
> node scripts/build.js

Binary found at /src/repo/client/data-bridge/node_modules/node-sass/vendor/linux-x64-64/binding.node
Testing binary
Binary is fine

> fibers_node_v8@3.1.5 preinstall /src/repo/client/data-bridge/node_modules/fibers_node_v8
> node preinstall.js


> fibers_node_v8@3.1.5 install /src/repo/client/data-bridge/node_modules/fibers_node_v8
> node build.js

ignore install

> fibers@4.0.3 install /src/repo/client/data-bridge/node_modules/fibers
> node build.js || nodejs build.js

`linux-x64-64-glibc` exists; testing
Binary is fine; exiting

> ejs@3.1.2 postinstall /src/repo/client/data-bridge/node_modules/@wdio/cli/node_modules/ejs
> node --harmony ./postinstall.js

Thank you for installing EJS: built with the Jake JavaScript build tool (https://jakejs.com/)


> fsevents@1.2.11 install /src/repo/client/data-bridge/node_modules/fsevents
> node-gyp rebuild

make: Entering directory '/src/repo/client/data-bridge/node_modules/fsevents/build'
  SOLINK_MODULE(target) Release/obj.target/.node
  COPY Release/.node
make: Leaving directory '/src/repo/client/data-bridge/node_modules/fsevents/build'

> ejs@2.7.4 postinstall /src/repo/client/data-bridge/node_modules/ejs
> node ./postinstall.js


> core-js@2.6.9 postinstall /src/repo/view/lib/wikibase-tainted-ref/node_modules/core-js
> node scripts/postinstall || echo "ignore"

Thank you for installing EJS: built with the Jake JavaScript build tool (https://jakejs.com/)

Thank you for using core-js ( https://github.com/zloirock/core-js ) for polyfilling JavaScript standard library!

The project needs your help! Please consider supporting of core-js on Open Collective or Patreon: 
> https://opencollective.com/core-js 
> https://www.patreon.com/zloirock 

Also, the author of core-js ( https://github.com/zloirock ) is looking for a good job -)


> core-js@2.6.11 postinstall /src/repo/client/data-bridge/node_modules/babel-runtime/node_modules/core-js
> node -e "try{require('./postinstall')}catch(e){}"


> yorkie@2.0.0 install /src/repo/client/data-bridge/node_modules/yorkie
> node bin/install.js


> node-sass@4.13.1 install /src/repo/view/lib/wikibase-tainted-ref/node_modules/node-sass
> node scripts/install.js

setting up Git hooks
can't find .git directory, skipping Git hooks installation
Cached binary found at /cache/_cacache/node-sass/4.13.1/linux-x64-64_binding.node

> node-sass@4.13.1 postinstall /src/repo/view/lib/wikibase-tainted-ref/node_modules/node-sass
> node scripts/build.js


> core-js-pure@3.6.4 postinstall /src/repo/client/data-bridge/node_modules/core-js-pure
> node -e "try{require('./postinstall')}catch(e){}"

Binary found at /src/repo/view/lib/wikibase-tainted-ref/node_modules/node-sass/vendor/linux-x64-64/binding.node
Testing binary
Binary is fine

> fsevents@1.2.9 install /src/repo/view/lib/wikibase-tainted-ref/node_modules/fsevents
> node install


> data-bridge@0.1.0 prepare /src/repo/client/data-bridge
> node build/wikimedia-ui-base.js


> fibers_node_v8@3.1.5 preinstall /src/repo/view/lib/wikibase-tainted-ref/node_modules/fibers_node_v8
> node preinstall.js

added 2824 packages in 157.016s

> fibers_node_v8@3.1.5 install /src/repo/view/lib/wikibase-tainted-ref/node_modules/fibers_node_v8
> node build.js

ignore install

> fibers@4.0.1 install /src/repo/view/lib/wikibase-tainted-ref/node_modules/fibers
> node build.js || nodejs build.js

`linux-x64-64-glibc` exists; testing
Binary is fine; exiting

> yorkie@2.0.0 install /src/repo/view/lib/wikibase-tainted-ref/node_modules/yorkie
> node bin/install.js

setting up Git hooks
can't find .git directory, skipping Git hooks installation

> core-js@3.6.4 postinstall /src/repo/view/lib/wikibase-tainted-ref/node_modules/@storybook/api/node_modules/core-js
> node -e "try{require('./postinstall')}catch(e){}"


> core-js@3.6.4 postinstall /src/repo/view/lib/wikibase-tainted-ref/node_modules/@storybook/theming/node_modules/core-js
> node -e "try{require('./postinstall')}catch(e){}"


> core-js@3.6.4 postinstall /src/repo/view/lib/wikibase-tainted-ref/node_modules/@storybook/client-logger/node_modules/core-js
> node -e "try{require('./postinstall')}catch(e){}"


> core-js@3.6.4 postinstall /src/repo/view/lib/wikibase-tainted-ref/node_modules/@storybook/router/node_modules/core-js
> node -e "try{require('./postinstall')}catch(e){}"


> core-js@3.6.4 postinstall /src/repo/view/lib/wikibase-tainted-ref/node_modules/@storybook/core-events/node_modules/core-js
> node -e "try{require('./postinstall')}catch(e){}"


> core-js@3.6.4 postinstall /src/repo/view/lib/wikibase-tainted-ref/node_modules/@storybook/channels/node_modules/core-js
> node -e "try{require('./postinstall')}catch(e){}"


> core-js@3.6.4 postinstall /src/repo/view/lib/wikibase-tainted-ref/node_modules/@storybook/addons/node_modules/core-js
> node -e "try{require('./postinstall')}catch(e){}"


> core-js@3.6.4 postinstall /src/repo/view/lib/wikibase-tainted-ref/node_modules/@storybook/vue/node_modules/core-js
> node -e "try{require('./postinstall')}catch(e){}"


> core-js@3.6.4 postinstall /src/repo/view/lib/wikibase-tainted-ref/node_modules/lazy-universal-dotenv/node_modules/core-js
> node -e "try{require('./postinstall')}catch(e){}"


> ejs@2.7.4 postinstall /src/repo/view/lib/wikibase-tainted-ref/node_modules/@storybook/core/node_modules/ejs
> node ./postinstall.js

Thank you for installing EJS: built with the Jake JavaScript build tool (https://jakejs.com/)


> core-js@3.6.4 postinstall /src/repo/view/lib/wikibase-tainted-ref/node_modules/@storybook/core/node_modules/core-js
> node -e "try{require('./postinstall')}catch(e){}"


> core-js@3.6.4 postinstall /src/repo/view/lib/wikibase-tainted-ref/node_modules/simplebar/node_modules/core-js
> node -e "try{require('./postinstall')}catch(e){}"


> core-js@3.6.4 postinstall /src/repo/view/lib/wikibase-tainted-ref/node_modules/@storybook/components/node_modules/core-js
> node -e "try{require('./postinstall')}catch(e){}"


> core-js-pure@3.6.4 postinstall /src/repo/view/lib/wikibase-tainted-ref/node_modules/core-js-pure
> node -e "try{require('./postinstall')}catch(e){}"


> core-js@3.6.4 postinstall /src/repo/view/lib/wikibase-tainted-ref/node_modules/@storybook/ui/node_modules/core-js
> node -e "try{require('./postinstall')}catch(e){}"


> core-js@3.6.4 postinstall /src/repo/view/lib/wikibase-tainted-ref/node_modules/@storybook/node-logger/node_modules/core-js
> node -e "try{require('./postinstall')}catch(e){}"


> core-js@3.6.4 postinstall /src/repo/view/lib/wikibase-tainted-ref/node_modules/@storybook/channel-postmessage/node_modules/core-js
> node -e "try{require('./postinstall')}catch(e){}"


> core-js@3.6.4 postinstall /src/repo/view/lib/wikibase-tainted-ref/node_modules/@storybook/client-api/node_modules/core-js
> node -e "try{require('./postinstall')}catch(e){}"


> core-js@3.6.4 postinstall /src/repo/view/lib/wikibase-tainted-ref/node_modules/@storybook/addon-links/node_modules/core-js
> node -e "try{require('./postinstall')}catch(e){}"


> core-js@3.6.4 postinstall /src/repo/view/lib/wikibase-tainted-ref/node_modules/@storybook/addon-actions/node_modules/core-js
> node -e "try{require('./postinstall')}catch(e){}"


> core-js@3.6.4 postinstall /src/repo/view/lib/wikibase-tainted-ref/node_modules/@storybook/addon-a11y/node_modules/core-js
> node -e "try{require('./postinstall')}catch(e){}"


> tainted-ref@0.1.0 prepare /src/repo/view/lib/wikibase-tainted-ref
> node build/wikimedia-ui-base.js

added 2971 packages in 172.849s
added 1185 packages in 206.238s

$ npm test

> Wikibase@0.1.0 test /src/repo
> npm-run-all -p test-fast:*


> Wikibase@0.1.0 test-fast:tainted-ref /src/repo
> npm --prefix view/lib/wikibase-tainted-ref test


> Wikibase@0.1.0 test-fast:bridge /src/repo
> npm --prefix client/data-bridge test


> Wikibase@0.1.0 test-fast:grunt /src/repo
> grunt test


> data-bridge@0.1.0 test /src/repo/client/data-bridge
> npm-run-all test:*


> tainted-ref@0.1.0 test /src/repo/view/lib/wikibase-tainted-ref
> npm-run-all test:*

Running "eslint:all" (eslint) task

> tainted-ref@0.1.0 test:unit /src/repo/view/lib/wikibase-tainted-ref
> vue-cli-service test:unit -c ./jest.config.js


> data-bridge@0.1.0 test:lint /src/repo/client/data-bridge
> vue-cli-service lint --max-warnings 0 --no-fix . && stylelint --syntax scss 'src/**/*.(vue|scss)'

PASS tests/unit/MWHookHandler.spec.ts (68.563s)
PASS tests/unit/StatementTracker.spec.ts (72.675s)
PASS tests/unit/store/actions.spec.ts (10.758s)
PASS tests/unit/store/mutations.spec.ts (6.715s)
PASS tests/unit/TaintedPopper.spec.ts (79.812s)
PASS tests/unit/store/getters.spec.ts (5.166s)
PASS tests/unit/Popper.spec.ts (6.227s)
PASS tests/unit/ReferenceListChangeCounter.spec.ts
PASS tests/unit/App.spec.ts
PASS tests/unit/TaintedChecker.spec.ts
PASS tests/unit/store/index.spec.ts
PASS tests/unit/TaintedIcon.spec.ts (7.266s)

Test Suites: 12 passed, 12 total
Tests:       68 passed, 68 total
Snapshots:   0 total
Time:        132.19s
Ran all test suites.

> tainted-ref@0.1.0 test:lint /src/repo/view/lib/wikibase-tainted-ref
> vue-cli-service lint --max-warnings 0 --no-fix . && stylelint --syntax scss 'src/**/*.(vue|scss)'

 DONE  No lint errors found!
 DONE  No lint errors found!

> data-bridge@0.1.0 test:unit /src/repo/client/data-bridge
> vue-cli-service test:unit -c ./jest.config.unit.js


> tainted-ref@0.1.0 test:distnodiff /src/repo/view/lib/wikibase-tainted-ref
> npm run build-to-temp && build/testnodiff.sh dist/ $npm_package_config_tempBuildDirectory


> tainted-ref@0.1.0 build-to-temp /src/repo/view/lib/wikibase-tainted-ref
> npm-run-all "build:* -- --dest $npm_package_config_tempBuildDirectory" --


> tainted-ref@0.1.0 build:app /src/repo/view/lib/wikibase-tainted-ref
> rm -rf node_modules/.cache && NODE_ENV=production vue-cli-service build --no-clean --target lib --formats commonjs src/main.ts "--dest" "/tmp/tainted-refs-build"


-  Building for production as library (commonjs)...
Starting type checking service...
Using 1 worker with 2048MB memory limit
 DONE  Compiled successfully in 27646ms8:33:25 PM

  File                                      Size             Gzipped

  ../../../../../tmp/tainted-refs-build/    163.36 KiB       36.43 KiB
  tainted-ref.common.js
  ../../../../../tmp/tainted-refs-build/    2.85 KiB         0.89 KiB
  tainted-ref.css

  Images and other types of assets omitted.


> tainted-ref@0.1.0 build:init /src/repo/view/lib/wikibase-tainted-ref
> rm -rf node_modules/.cache && NODE_ENV=production vue-cli-service build --no-clean "--dest" "/tmp/tainted-refs-build"


-  Building for production...
Starting type checking service...
Using 1 worker with 2048MB memory limit
PASS tests/unit/store/getters.spec.ts (33.405s)
 DONE  Compiled successfully in 25427ms8:33:58 PM

  File                                      Size             Gzipped

  ../../../../../tmp/tainted-refs-build/    61.39 KiB        18.72 KiB
  tainted-ref.app.js
  ../../../../../tmp/tainted-refs-build/    47.67 KiB        12.62 KiB
  tainted-ref.init.js
  ../../../../../tmp/tainted-refs-build/    4.27 KiB         1.03 KiB
  style.css
  ../../../../../tmp/tainted-refs-build/    2.85 KiB         0.89 KiB
  tainted-ref.app.css

  Images and other types of assets omitted.

 DONE  Build complete. The ../../../../../tmp/tainted-refs-build directory is ready to be deployed.
 INFO  Check out deployment instructions at https://cli.vuejs.org/guide/deployment.html
      
PASS tests/unit/services/createServices.spec.ts (8.366s)
PASS tests/unit/store/actions.spec.ts (46.007s)
PASS tests/unit/presentation/components/ErrorPermission.spec.ts (47.294s)
PASS tests/unit/data-access/ApiPageEditPermissionErrorsRepository.spec.ts
PASS tests/unit/presentation/components/AppHeader.spec.ts
PASS tests/unit/data-access/CombiningPermissionsRepository.spec.ts
PASS tests/unit/store/statements/getters.spec.ts
PASS tests/unit/presentation/components/Loading.spec.ts
PASS tests/unit/presentation/components/EventEmittingButton.spec.ts
PASS tests/unit/data-access/ApiWritingRepository.spec.ts
PASS tests/unit/mediawiki/init.spec.ts
PASS tests/unit/mediawiki/BridgeDomElementsSelector.spec.ts
PASS tests/unit/presentation/components/ErrorWrapper.spec.ts (10.096s)
PASS tests/unit/store/mutations.spec.ts
PASS tests/unit/presentation/App.spec.ts (25.032s)
PASS tests/unit/data-access/ApiCore.spec.ts
PASS tests/unit/data-access/TrimmingWritingRepository.spec.ts
PASS tests/unit/store/entity/actions.spec.ts
PASS tests/unit/data-access/BatchingApi.spec.ts
PASS tests/unit/data-access/SpecialPageReadingEntityRepository.spec.ts
PASS tests/unit/data-access/ApiRenderReferencesRepository.spec.ts
PASS tests/unit/presentation/components/ErrorSaving.spec.ts
PASS tests/unit/presentation/components/ErrorSavingAssertUser.spec.ts
PASS tests/unit/store/statements/MainSnakPath.spec.ts
PASS tests/unit/mediawiki/Dispatcher.spec.ts
PASS tests/unit/data-access/ApiRepoConfigRepository.spec.ts
PASS tests/unit/presentation/components/ErrorUnsupportedSnakType.spec.ts
PASS tests/unit/data-access/ApiEntityLabelRepository.spec.ts
PASS tests/unit/change-op/statement-mutation/strategies/UpdateMutationStrategy.spec.ts
PASS tests/unit/presentation/components/StringDataValue.spec.ts
PASS tests/unit/presentation/components/EditDecision.spec.ts
PASS tests/unit/presentation/components/ErrorUnsupportedDatatype.spec.ts
PASS tests/unit/change-op/statement-mutation/strategies/ReplaceMutationStrategy.spec.ts (5.091s)
PASS tests/unit/main.spec.ts (194.464s)
PASS tests/unit/presentation/components/ErrorUnknown.spec.ts (190.763s)
PASS tests/unit/data-access/RepoRouter.spec.ts
PASS tests/unit/presentation/extendVueEnvironment.spec.ts (187.538s)
PASS tests/unit/mediawiki/prepareContainer.spec.ts
PASS tests/unit/presentation/components/ErrorPermissionInfo.spec.ts
PASS tests/unit/presentation/plugins/BridgeConfigPlugin/BridgeConfig.spec.ts
PASS tests/unit/presentation/components/ReportIssue.spec.ts
PASS tests/unit/presentation/components/ReferenceSection.spec.ts
PASS tests/unit/presentation/components/DataBridge.spec.ts
PASS tests/unit/data-access/ApiWbgetentities.spec.ts
PASS tests/unit/data-access/ApiPropertyDataTypeRepository.spec.ts
PASS tests/unit/presentation/components/ErrorDeprecatedStatement.spec.ts
PASS tests/unit/presentation/components/ErrorAmbiguousStatement.spec.ts
PASS tests/unit/presentation/components/ProcessDialogHeader.spec.ts
PASS tests/unit/store/newMockableEntityRevision.spec.ts
PASS tests/unit/mediawiki/MwInitTracker.spec.ts
PASS tests/unit/data-access/ApiReadingEntityRepository.spec.ts
PASS tests/unit/presentation/components/License.spec.ts
PASS tests/unit/data-access/MwLanguageInfoRepository.spec.ts
PASS tests/unit/data-access/DataBridgeTrackerService.spec.ts
PASS tests/unit/presentation/components/BailoutActions.spec.ts
PASS tests/unit/tracking/mutationsTrackerPlugin.spec.ts
PASS tests/unit/presentation/components/ThankYou.spec.ts
PASS tests/unit/store/entity/mutations.spec.ts
PASS tests/unit/data-access/ApiQuery.spec.ts
PASS tests/unit/presentation/IconMessageBox.spec.ts
PASS tests/unit/presentation/components/PropertyLabel.spec.ts
PASS tests/unit/store/statements/mutations.spec.ts
PASS tests/unit/data-access/MwMessagesRepository.spec.ts
PASS tests/unit/data-access/ApiPurge.spec.ts
PASS tests/unit/mediawiki/subscribeToEvents.spec.ts
PASS tests/unit/presentation/directives/inlanguage.spec.ts
PASS tests/unit/store/statements/actions.spec.ts
PASS tests/unit/presentation/components/TermLabel.spec.ts
PASS tests/unit/presentation/components/PageList.spec.ts
PASS tests/unit/presentation/components/WarningAnonymousEdit.spec.ts
PASS tests/unit/presentation/plugins/MessagesPlugin/Messages.spec.ts
PASS tests/unit/services/ServiceContainer.spec.ts
PASS tests/unit/presentation/components/UserLink.spec.ts
PASS tests/unit/tracking/PrefixingEventTracker.spec.ts
PASS tests/unit/presentation/components/ErrorSavingEditConflict.spec.ts
PASS tests/unit/events/repeater.spec.ts
PASS tests/unit/change-op/statement-mutation/statementMutationFactory.spec.ts
PASS tests/unit/mediawiki/facades/EventTracker.spec.ts
PASS tests/unit/presentation/components/RadioGroup.spec.ts
PASS tests/unit/store/index.spec.ts
PASS tests/unit/utils/errorTypeFormatter.spec.ts
PASS tests/unit/presentation/plugins/RepoRouter/RepoRouterPlugin.spec.ts
PASS tests/unit/data-access/ClientRouter.spec.ts
PASS tests/unit/store/clone.spec.ts
PASS tests/unit/timer.spec.ts

Test Suites: 86 passed, 86 total
Tests:       604 passed, 604 total
Snapshots:   11 passed, 11 total
Time:        314.096s
Ran all test suites.

> data-bridge@0.1.0 test:integration /src/repo/client/data-bridge
> vue-cli-service test:unit -c ./jest.config.integration.js

Killed
npm ERR! code ELIFECYCLE
npm ERR! errno 137
npm ERR! Wikibase@0.1.0 test-fast:grunt: `grunt test`
npm ERR! Exit status 137
npm ERR! 
npm ERR! Failed at the Wikibase@0.1.0 test-fast:grunt script.
npm ERR! This is probably not a problem with npm. There is likely additional logging output above.

npm ERR! A complete log of this run can be found in:
npm ERR!     /cache/_logs/2021-05-23T20_46_21_928Z-debug.log
ERROR: "test-fast:grunt" exited with 137.
npm ERR! Test failed.  See above for more details.

Traceback (most recent call last):
  File "/venv/lib/python3.7/site-packages/runner-0.1.0-py3.7.egg/runner/__init__.py", line 1317, in main
    libup.run(args.repo, args.output, args.branch)
  File "/venv/lib/python3.7/site-packages/runner-0.1.0-py3.7.egg/runner/__init__.py", line 1256, in run
    self.npm_upgrade(plan)
  File "/venv/lib/python3.7/site-packages/runner-0.1.0-py3.7.egg/runner/__init__.py", line 964, in npm_upgrade
    self.npm_test()
  File "/venv/lib/python3.7/site-packages/runner-0.1.0-py3.7.egg/runner/__init__.py", line 254, in npm_test
    self.check_call(['npm', 'test'])
  File "/venv/lib/python3.7/site-packages/runner-0.1.0-py3.7.egg/runner/shell2.py", line 40, in check_call
    res.check_returncode()
  File "/usr/lib/python3.7/subprocess.py", line 428, in check_returncode
    self.stderr)
subprocess.CalledProcessError: Command '['npm', 'test']' returned non-zero exit status 1.
Source code is licensed under the AGPL.